Target
Delta-type opioid receptor
Ligand
BDBM50297341
Substrate
Meas. Tech.
ChEMBL_583044 (CHEMBL1056543)
Ki
13±n/a nM
Citation
 Le Bourdonnec, BWindh, RTLeister, LKZhou, QJAjello, CWGu, MChu, GHTuthill, PABarker, WMKoblish, MWiant, DDGraczyk, TMBelanger, SCassel, JAFeschenko, MSBrogdon, BLSmith, SADerelanko, MJKutz, SLittle, PJDeHaven, RNDeHaven-Hudkins, DLDolle, RE Spirocyclic delta opioid receptor agonists for the treatment of pain: discovery of N,N-diethyl-3-hydroxy-4-(spiro[chromene-2,4'-piperidine]-4-yl) benzamide (ADL5747). J Med Chem 52:5685-702 (2009)  
Target
Name:
Delta-type opioid receptor
Synonyms:
D-OR-1 Delta opioid receptor OPIATE Delta OPRD1 OPRK1 | opioid receptor, delta 1
Type:
G Protein-Coupled Receptor (GPCR)
Mol. Mass.:
40382.98
Organism:
Homo sapiens (Human)
Description:
Competition binding assays were carried out using membrane preparations from transfected HN9.10 cells that constitutively expressed the delta opioid receptor.
Residue:
372
  
Inhibitor
Name:
BDBM50297341
Synonyms:
CHEMBL559414 | N,N-Diethyl-3-fluoro-4-(spiro[chromene-2,4'-piperidine]-4-yl)-benzamide
Type:
Small organic molecule
Emp. Form.:
C24H27FN2O2
Mol. Mass.:
394.4818
SMILES:
CCN(CC)C(=O)c1ccc(C2=CC3(CCNCC3)Oc3ccccc23)c(F)c1
: