Target
Potassium voltage-gated channel subfamily H member 2
Ligand
BDBM50297340
Substrate
Meas. Tech.
ChEMBL_583051 (CHEMBL1056550)
IC50
4243±n/a nM
Citation
 Le Bourdonnec, BWindh, RTLeister, LKZhou, QJAjello, CWGu, MChu, GHTuthill, PABarker, WMKoblish, MWiant, DDGraczyk, TMBelanger, SCassel, JAFeschenko, MSBrogdon, BLSmith, SADerelanko, MJKutz, SLittle, PJDeHaven, RNDeHaven-Hudkins, DLDolle, RE Spirocyclic delta opioid receptor agonists for the treatment of pain: discovery of N,N-diethyl-3-hydroxy-4-(spiro[chromene-2,4'-piperidine]-4-yl) benzamide (ADL5747). J Med Chem 52:5685-702 (2009)  
Target
Name:
Potassium voltage-gated channel subfamily H member 2
Synonyms:
1,3-beta-glucan synthase component GLS2 ERG Eag-related protein 1 Ether-a-go-go-related gene (HERG) Ether-a-go-go-related gene potassium channel 1 Ether-a-go-go-related gene potassium channel 1 (hERG1) Ether-a-go-go-related protein 1 H-ERG KCNH2 Potassium voltage-gated channel subfamily H member 2 (hERG) Voltage-gated potassium channel subunit Kv11.1 hERG Potassium Channel 1 | putative potassium channel subunit
Type:
Multi-pass membrane protein
Mol. Mass.:
126672.65
Organism:
Homo sapiens (Human)
Description:
Q12809
Residue:
1159
  
Inhibitor
Name:
BDBM50297340
Synonyms:
CHEMBL562478 | N,N-Diethyl-3-methyl-4-(spiro[chromene-2,4'-piperidine]-4-yl)-benzamide
Type:
Small organic molecule
Emp. Form.:
C25H30N2O2
Mol. Mass.:
390.5179
SMILES:
CCN(CC)C(=O)c1ccc(C2=CC3(CCNCC3)Oc3ccccc23)c(C)c1
: