Target
Cytochrome P450 2D6
Ligand
BDBM50297320
Substrate
Meas. Tech.
ChEMBL_583050 (CHEMBL1056549)
IC50
7600±n/a nM
Citation
 Le Bourdonnec, BWindh, RTLeister, LKZhou, QJAjello, CWGu, MChu, GHTuthill, PABarker, WMKoblish, MWiant, DDGraczyk, TMBelanger, SCassel, JAFeschenko, MSBrogdon, BLSmith, SADerelanko, MJKutz, SLittle, PJDeHaven, RNDeHaven-Hudkins, DLDolle, RE Spirocyclic delta opioid receptor agonists for the treatment of pain: discovery of N,N-diethyl-3-hydroxy-4-(spiro[chromene-2,4'-piperidine]-4-yl) benzamide (ADL5747). J Med Chem 52:5685-702 (2009)  
Target
Name:
Cytochrome P450 2D6
Synonyms:
CP2D6_HUMAN CYP2DL1 Cytochrome P450 2D6 (CYP2D6) P450-DB1
Type:
Protein
Mol. Mass.:
55774.82
Organism:
Homo sapiens (Human)
Description:
P10635
Residue:
497
  
Inhibitor
Name:
BDBM50297320
Synonyms:
CHEMBL551414 | Morpholino(4-(spiro[chromene-2,4'-piperidine]-4-yl)phenyl)-methanone
Type:
Small organic molecule
Emp. Form.:
C24H26N2O3
Mol. Mass.:
390.4748
SMILES:
O=C(N1CCOCC1)c1ccc(cc1)C1=CC2(CCNCC2)Oc2ccccc12
: