Target
Cytochrome P450 2C9
Ligand
BDBM50029559
Substrate
Meas. Tech.
ChEMBL_583358 (CHEMBL1053351)
IC50
0.500000±n/a nM
Citation
 Hutchinson, JHLi, YArruda, JMBaccei, CBain, GChapman, CCorrea, LDarlington, JKing, CDLee, CLorrain, DProdanovich, PRong, HSantini, AStock, NPrasit, PEvans, JF 5-lipoxygenase-activating protein inhibitors: development of 3-[3-tert-butylsulfanyl-1-[4-(6-methoxy-pyridin-3-yl)-benzyl]-5-(pyridin-2-ylmethoxy)-1H-indol-2-yl]-2,2-dimethyl-propionic acid (AM103). J Med Chem 52:5803-15 (2009)  
Target
Name:
Cytochrome P450 2C9
Synonyms:
(R)-limonene 6-monooxygenase CP2C9_HUMAN CYP2C9 Cytochrome P450 2C9 (CYP2C9 ) P-450MP P450 PB-1 | S-mephenytoin 4-hydroxylase
Type:
Enzyme
Mol. Mass.:
55636.33
Organism:
Homo sapiens (Human)
Description:
P11712
Residue:
490
  
Inhibitor
Name:
BDBM50029559
Synonyms:
2-[3-tert-Butylsulfanyl-1-(4-chloro-benzyl)-5-(quinolin-2-ylmethoxy)-1H-indol-2-yl]-2-methyl-propionic acid 3-(3-(tert-butylthio)-1-(4-chlorobenzyl)-5-(quinolin-2-ylmethoxy)-1H-indol-2-yl)-2,2-dimethylpropanoic acid 3-[3-tert-Butylsulfanyl-1-(4-chloro-benzyl)-5-(quinolin-2-ylmethoxy)-1H-indol-2-yl]-2,2-dimethyl-propionic acid L-686708 | MK-591
Type:
Small organic molecule
Emp. Form.:
C34H35ClN2O3S
Mol. Mass.:
587.171
SMILES:
CC(C)(C)Sc1c(CC(C)(C)C(O)=O)n(Cc2ccc(Cl)cc2)c2ccc(OCc3ccc4ccccc4n3)cc12
: