Target
Bifunctional epoxide hydrolase 2
Ligand
BDBM50297402
Substrate
Meas. Tech.
ChEMBL_582788 (CHEMBL1058192)
IC50
9±n/a nM
Citation
 Eldrup, ABSoleymanzadeh, FTaylor, SJMuegge, IFarrow, NAJoseph, DMcKellop, KMan, CCKukulka, ADe Lombaert, S Structure-based optimization of arylamides as inhibitors of soluble epoxide hydrolase. J Med Chem 52:5880-95 (2009)  
Target
Name:
Bifunctional epoxide hydrolase 2
Synonyms:
Ephx2 HYES_RAT
Type:
PROTEIN
Mol. Mass.:
62337.15
Organism:
Rattus norvegicus
Description:
ChEMBL_1465995
Residue:
554
  
Inhibitor
Name:
BDBM50297402
Synonyms:
CHEMBL563417 | N-[4,4-Bis-(4-fluorophenyl)-propyl]-6-hydroxy-nicotinamide
Type:
Small organic molecule
Emp. Form.:
C21H18F2N2O2
Mol. Mass.:
368.3766
SMILES:
Fc1ccc(cc1)C(CCNC(=O)c1ccc(=O)[nH]c1)c1ccc(F)cc1
: