Target
Bifunctional epoxide hydrolase 2
Ligand
BDBM50297409
Substrate
Meas. Tech.
ChEMBL_582787 (CHEMBL1058191)
IC50
700±n/a nM
Citation
 Eldrup, ABSoleymanzadeh, FTaylor, SJMuegge, IFarrow, NAJoseph, DMcKellop, KMan, CCKukulka, ADe Lombaert, S Structure-based optimization of arylamides as inhibitors of soluble epoxide hydrolase. J Med Chem 52:5880-95 (2009)  
Target
Name:
Bifunctional epoxide hydrolase 2
Synonyms:
Cytosolic epoxide hydrolase 2 EPHX2 HYES_HUMAN Soluble epoxide hydrolase (sEH) | epoxide hydrolase 2, cytoplasmic
Type:
Enzyme
Mol. Mass.:
62613.07
Organism:
Homo sapiens (Human)
Description:
P34913
Residue:
555
  
Inhibitor
Name:
BDBM50297409
Synonyms:
CHEMBL560538 | N-(3-Phenyl-propyl)-nicotinamide
Type:
Small organic molecule
Emp. Form.:
C15H16N2O
Mol. Mass.:
240.3003
SMILES:
O=C(NCCCc1ccccc1)c1cccnc1
: