Target
Cytochrome P450 2J2
Ligand
BDBM50297412
Substrate
Meas. Tech.
ChEMBL_582800 (CHEMBL1058985)
IC50
2000±n/a nM
Citation
 Eldrup, ABSoleymanzadeh, FTaylor, SJMuegge, IFarrow, NAJoseph, DMcKellop, KMan, CCKukulka, ADe Lombaert, S Structure-based optimization of arylamides as inhibitors of soluble epoxide hydrolase. J Med Chem 52:5880-95 (2009)  
Target
Name:
Cytochrome P450 2J2
Synonyms:
CP2J2_HUMAN | CYP2J2
Type:
Enzyme
Mol. Mass.:
57623.04
Organism:
Homo sapiens (Human)
Description:
P51589
Residue:
502
  
Inhibitor
Name:
BDBM50297412
Synonyms:
CHEMBL560740 | N-[3,3-Bis-(4-fluorophenyl)-propyl]-6-(2,2,2-trifluoro-ethoxy)-nicotinamide
Type:
Small organic molecule
Emp. Form.:
C23H19F5N2O2
Mol. Mass.:
450.4012
SMILES:
Fc1ccc(cc1)C(CCNC(=O)c1ccc(OCC(F)(F)F)nc1)c1ccc(F)cc1
: