Target
Bifunctional epoxide hydrolase 2
Ligand
BDBM50297417
Substrate
Meas. Tech.
ChEMBL_582787 (CHEMBL1058191)
IC50
5±n/a nM
Citation
 Eldrup, ABSoleymanzadeh, FTaylor, SJMuegge, IFarrow, NAJoseph, DMcKellop, KMan, CCKukulka, ADe Lombaert, S Structure-based optimization of arylamides as inhibitors of soluble epoxide hydrolase. J Med Chem 52:5880-95 (2009)  
Target
Name:
Bifunctional epoxide hydrolase 2
Synonyms:
Cytosolic epoxide hydrolase 2 EPHX2 HYES_HUMAN Soluble epoxide hydrolase (sEH) | epoxide hydrolase 2, cytoplasmic
Type:
Enzyme
Mol. Mass.:
62613.07
Organism:
Homo sapiens (Human)
Description:
P34913
Residue:
555
  
Inhibitor
Name:
BDBM50297417
Synonyms:
CHEMBL551338 | N-[3,3-Bis-(4-fluorophenyl)-propyl]-4-methanesulfonyl-benzamide
Type:
Small organic molecule
Emp. Form.:
C23H21F2NO3S
Mol. Mass.:
429.48
SMILES:
CS(=O)(=O)c1ccc(cc1)C(=O)NCCC(c1ccc(F)cc1)c1ccc(F)cc1
: