Target
Sodium-dependent serotonin transporter
Ligand
BDBM50010859
Substrate
Meas. Tech.
ChEMBL_582828 (CHEMBL1061664)
Ki
7.57±n/a nM
Citation
 White, JDJuniku, RHuang, KYang, JWong, DT Synthesis of 1,1-[1-naphthyloxy-2-thiophenyl]-2-methylaminomethylcyclopropanes and their evaluation as inhibitors of serotonin, norepinephrine, and dopamine transporters. J Med Chem 52:5872-9 (2009)  
Target
Name:
Sodium-dependent serotonin transporter
Synonyms:
5-HT Transporter 5HTT SC6A4_HUMAN SLC6A4 Serotonin transporter (5HTT) Sodium-dependent serotonin transporter (SERT) | Solute carrier family 6 member 4
Type:
Multi-pass membrane protein
Mol. Mass.:
70322.51
Organism:
Homo sapiens (Human)
Description:
P31645
Residue:
630
  
Inhibitor
Name:
BDBM50010859
Synonyms:
CHEMBL11 IMIPRAMINE PAMOATE | Imipramin
Type:
Small organic molecule
Emp. Form.:
C19H24N2
Mol. Mass.:
280.4073
SMILES:
CN(C)CCCN1c2ccccc2CCc2ccccc12
: