Target
Amine oxidase [flavin-containing] B
Ligand
BDBM50131698
Substrate
Meas. Tech.
ChEMBL_585481 (CHEMBL1059215)
IC50
61000±n/a nM
Citation
 Boppana, KDubey, PKJagarlapudi, SAVadivelan, SRambabu, G Knowledge based identification of MAO-B selective inhibitors using pharmacophore and structure based virtual screening models. Eur J Med Chem 44:3584-90 (2009)  
Target
Name:
Amine oxidase [flavin-containing] B
Synonyms:
AOFB_HUMAN MAOB Monoamine oxidase type B (MAO B) Monoamine oxidase type B (MAOB)
Type:
Protein
Mol. Mass.:
58768.76
Organism:
Homo sapiens (Human)
Description:
P27338
Residue:
520
  
Inhibitor
Name:
BDBM50131698
Synonyms:
(Z)-resveratrol 5-[(Z)-2-(4-hydroxyphenyl)vinyl]benzene-1,3-diol cis-resveratrol
Type:
Small organic molecule
Emp. Form.:
C14H12O3
Mol. Mass.:
228.2433
SMILES:
Oc1ccc(\C=C/c2cc(O)cc(O)c2)cc1
: