Target
Mitogen-activated protein kinase 10
Ligand
BDBM50297482
Substrate
Meas. Tech.
ChEMBL_586022 (CHEMBL1063579)
Ki
2500±n/a nM
Citation
 Cao, JGao, HBemis, GSalituro, FLedeboer, MHarrington, EWilke, STaslimi, PPazhanisamy, SXie, XJacobs, MGreen, J Structure-based design and parallel synthesis of N-benzyl isatin oximes as JNK3 MAP kinase inhibitors. Bioorg Med Chem Lett 19:2891-5 (2009)  
Target
Name:
Mitogen-activated protein kinase 10
Synonyms:
JNK3 MAP kinase p49 3F12 MK10_HUMAN Mitogen-activated protein kinase 10 (Stress-activated protein kinase JNK3) (c-Jun N-terminal kinase 3) (MAP kinase p49 3F12) PRKM10 Stress-activated protein kinase JNK3 | c-Jun N-terminal kinase 3 (JNK3)
Type:
Enzyme
Mol. Mass.:
52586.89
Organism:
Homo sapiens (Human)
Description:
Residue:
464
  
Inhibitor
Name:
BDBM50297482
Synonyms:
1-benzyl-5-bromo-3-(hydroxyimino)indolin-2-one | CHEMBL552488
Type:
Small organic molecule
Emp. Form.:
C15H11BrN2O2
Mol. Mass.:
331.164
SMILES:
Brc1ccc2N(Cc3ccccc3)C(=O)C(N=O)c2c1
: