Target
Tyrosine-protein kinase Lck
Ligand
BDBM50297455
Substrate
Meas. Tech.
ChEMBL_586032 (CHEMBL1063589)
Ki
>30000±n/a nM
Citation
 Cao, JGao, HBemis, GSalituro, FLedeboer, MHarrington, EWilke, STaslimi, PPazhanisamy, SXie, XJacobs, MGreen, J Structure-based design and parallel synthesis of N-benzyl isatin oximes as JNK3 MAP kinase inhibitors. Bioorg Med Chem Lett 19:2891-5 (2009)  
Target
Name:
Tyrosine-protein kinase Lck
Synonyms:
2.7.10.2 LCK_HUMAN Leukocyte C-terminal Src kinase Lymphocyte-specific protein tyrosine kinase Protein YT16 Proto-oncogene tyrosine-protein kinase LCK T cell-specific protein-tyrosine kinase
Type:
Mol. Mass.:
57987.83
Organism:
Homo sapiens (Human)
Description:
P06239
Residue:
509
  
Inhibitor
Name:
BDBM50297455
Synonyms:
1-((6-fluoro-4H-benzo[d][1,3]dioxin-8-yl)methyl)-3-(hydroxyimino)-6-methylindolin-2-one | CHEMBL551140
Type:
Small organic molecule
Emp. Form.:
C18H15FN2O4
Mol. Mass.:
342.3211
SMILES:
Cc1ccc2C(N=O)C(=O)N(Cc3cc(F)cc4COCOc34)c2c1
: