Target
Prostaglandin G/H synthase 1
Ligand
BDBM50240374
Substrate
Meas. Tech.
ChEMBL_583548 (CHEMBL1059063)
IC50
3900±n/a nM
Citation
 Husain, AAhmad, AAlam, MMAjmal, MAhuja, P Fenbufen based 3-[5-(substituted aryl)-1,3,4-oxadiazol-2-yl]-1-(biphenyl-4-yl)propan-1-ones as safer antiinflammatory and analgesic agents. Eur J Med Chem 44:3798-804 (2009)  
Target
Name:
Prostaglandin G/H synthase 1
Synonyms:
COX1 Cyclooxygenase-1 (COX-1) PTGS1 | Prostaglandin G/H synthase (cyclooxygenase)
Type:
Protein
Mol. Mass.:
68868.60
Organism:
Ovis aries (Sheep)
Description:
Residue:
600
  
Inhibitor
Name:
BDBM50240374
Synonyms:
3-(4-biphenylylcarbonyl)propionic acid 4-(4-biphenylyl)-4-oxobutyric acid 4-biphenyl-4-yl-4-oxobutanoic acid Fenbufen | gamma-oxo(1,1'-biphenyl)-4-butanoic acid
Type:
Small organic molecule
Emp. Form.:
C16H14O3
Mol. Mass.:
254.2806
SMILES:
OC(=O)CCC(=O)c1ccc(cc1)-c1ccccc1
: