Target
M-phase inducer phosphatase 1
Ligand
BDBM50297584
Substrate
Meas. Tech.
ChEMBL_583686 (CHEMBL1061732)
IC50
2300±n/a nM
Citation
 Park, HLi, MChoi, JCho, HHam, SW Structure-based virtual screening approach to identify novel classes of Cdc25B phosphatase inhibitors. Bioorg Med Chem Lett 19:4372-5 (2009)  
Target
Name:
M-phase inducer phosphatase 1
Synonyms:
CDC25A Dual specificity phosphatase Cdc25A MPIP1_HUMAN | phosphatase Cdc25
Type:
Protein
Mol. Mass.:
59090.18
Organism:
Homo sapiens (Human)
Description:
P30304
Residue:
524
  
Inhibitor
Name:
BDBM50297584
Synonyms:
CHEMBL550614 | N-(3-(3-aminophenylamino)quinoxalin-2-yl)-4-chlorobenzenesulfonamide
Type:
Small organic molecule
Emp. Form.:
C20H16ClN5O2S
Mol. Mass.:
425.891
SMILES:
Nc1cccc(Nc2nc3ccccc3nc2NS(=O)(=O)c2ccc(Cl)cc2)c1
: