Target
Bile acid receptor
Ligand
BDBM50297942
Substrate
Meas. Tech.
ChEMBL_584610 (CHEMBL1059111)
EC50
220±n/a nM
Citation
 Akwabi-Ameyaw, ABass, JYCaldwell, RDCaravella, JAChen, LCreech, KLDeaton, DNMadauss, KPMarr, HBMcFadyen, RBMiller, ABNavas, FParks, DJSpearing, PKTodd, DWilliams, SPBruce Wisely, G FXR agonist activity of conformationally constrained analogs of GW 4064. Bioorg Med Chem Lett 19:4733-9 (2009)  
Target
Name:
Bile acid receptor
Synonyms:
BAR FXR HRR1 NR1H4_HUMAN RIP14 Retinoid X receptor-interacting protein 14 | farnesoid x receptor
Type:
Nuclear Receptor
Mol. Mass.:
55916.24
Organism:
Homo sapiens (Human)
Description:
Q96RI1
Residue:
486
  
Inhibitor
Name:
BDBM50297942
Synonyms:
4-[6-({[3-(2,6-Dichlorophenyl)-5-(1-methylethyl)-4-isoxazolyl]methyl}oxy)-1-benzothien-2-yl]benzoic acid | CHEMBL551019
Type:
Small organic molecule
Emp. Form.:
C28H21Cl2NO4S
Mol. Mass.:
538.442
SMILES:
CC(C)c1onc(c1COc1ccc2cc(sc2c1)-c1ccc(cc1)C(O)=O)-c1c(Cl)cccc1Cl
: