Target
Bile acid receptor
Ligand
BDBM50297959
Substrate
Meas. Tech.
ChEMBL_584608 (CHEMBL1059109)
EC50
1700±n/a nM
Citation
 Akwabi-Ameyaw, ABass, JYCaldwell, RDCaravella, JAChen, LCreech, KLDeaton, DNMadauss, KPMarr, HBMcFadyen, RBMiller, ABNavas, FParks, DJSpearing, PKTodd, DWilliams, SPBruce Wisely, G FXR agonist activity of conformationally constrained analogs of GW 4064. Bioorg Med Chem Lett 19:4733-9 (2009)  
Target
Name:
Bile acid receptor
Synonyms:
BAR FXR HRR1 NR1H4_HUMAN RIP14 Retinoid X receptor-interacting protein 14 | farnesoid x receptor
Type:
Nuclear Receptor
Mol. Mass.:
55916.24
Organism:
Homo sapiens (Human)
Description:
Q96RI1
Residue:
486
  
Inhibitor
Name:
BDBM50297959
Synonyms:
3-[(2-{2-[3-(2,6-Dichlorophenyl)-5-(1-methylethyl)-4-isoxazolyl]ethyl}-1,3-benzoxazol-7-yl)amino]benzoic acid | CHEMBL559890
Type:
Small organic molecule
Emp. Form.:
C28H23Cl2N3O4
Mol. Mass.:
536.406
SMILES:
CC(C)c1onc(c1CCc1nc2cccc(Nc3cccc(c3)C(O)=O)c2o1)-c1c(Cl)cccc1Cl
: