Target
Serine/threonine-protein kinase PLK1
Ligand
BDBM50297963
Substrate
Meas. Tech.
ChEMBL_584629 (CHEMBL1059130)
EC50
3750±n/a nM
Citation
 Sato, YOnozaki, YSugimoto, TKurihara, HKamijo, KKadowaki, CTsujino, TWatanabe, AOtsuki, SMitsuya, MIida, MHaze, KMachida, TNakatsuru, YKomatani, HKotani, HIwasawa, Y Imidazopyridine derivatives as potent and selective Polo-like kinase (PLK) inhibitors. Bioorg Med Chem Lett 19:4673-8 (2009)  
Target
Name:
Serine/threonine-protein kinase PLK1
Synonyms:
PLK PLK1 Polo-like kinase 1 (PlK1) STPK13 Serine/threonine-protein kinase 13 | polo-like kinase
Type:
Serine/threonine-protein kinase
Mol. Mass.:
68277.16
Organism:
Homo sapiens (Human)
Description:
P53350
Residue:
603
  
Inhibitor
Name:
BDBM50297963
Synonyms:
(R)-3-(1-(2-(hydroxymethyl)phenyl)ethoxy)-5-(imidazo[1,2-a]pyridin-3-yl)thiophene-2-carboxamide | CHEMBL560206
Type:
Small organic molecule
Emp. Form.:
C21H19N3O3S
Mol. Mass.:
393.459
SMILES:
C[C@@H](Oc1cc(sc1C(N)=O)-c1cnc2ccccn12)c1ccccc1CO
: