Target
Macrophage migration inhibitory factor
Ligand
BDBM50298023
Substrate
Meas. Tech.
ChEMBL_585089 (CHEMBL1054355)
IC50
500±n/a nM
Citation
 Balachandran, SRodge, AGadekar, PKYadav, VNKamath, DChetrapal-Kunwar, ABhatt, PSrinivasan, SSharma, SVishwakarma, RADagia, NM Novel derivatives of ISO-1 as potent inhibitors of MIF biological function. Bioorg Med Chem Lett 19:4773-6 (2009)  
Target
Name:
Macrophage migration inhibitory factor
Synonyms:
GIF Glycosylation-inhibiting factor L-dopachrome tautomerase MIF/CD74 (Macrophage migration inhibitory factor and HLA-DR antigens-associated invariant chain) MMIF Macrophage migration inhibitory factor (MIF) | Phenylpyruvate tautomerase
Type:
Enzyme
Mol. Mass.:
12478.18
Organism:
Homo sapiens (Human)
Description:
P14174
Residue:
115
  
Inhibitor
Name:
BDBM50298023
Synonyms:
2-(2-(3-(3-fluoro-4-hydroxyphenyl)-4,5-dihydroisoxazol-5-yl)ethyl)isoindoline-1,3-dione | CHEMBL554271
Type:
Small organic molecule
Emp. Form.:
C19H15FN2O4
Mol. Mass.:
354.3318
SMILES:
Oc1ccc(cc1F)C1=NOC(CCN2C(=O)c3ccccc3C2=O)C1
: