Target
5-hydroxytryptamine receptor 2C
Ligand
BDBM50298314
Substrate
Meas. Tech.
ChEMBL_588489 (CHEMBL1040387)
IC50
416±n/a nM
Citation
 Ahmed, AChoo, HCho, YSPark, WKPae, AN Identification of novel serotonin 2C receptor ligands by sequential virtual screening. Bioorg Med Chem 17:4559-68 (2009)  
Target
Name:
5-hydroxytryptamine receptor 2C
Synonyms:
5-HT-2C 5-HT2C-INI 5-HTR2C 5-hydroxytryptamine receptor 2C (5-HT-2C) 5HT-1C HTR1C Serotonin (5-HT3) receptor Serotonin Receptor 2C
Type:
G Protein-Coupled Receptor (GPCR)
Mol. Mass.:
51836.79
Organism:
Homo sapiens (Human)
Description:
P28335
Residue:
458
  
Inhibitor
Name:
BDBM50298314
Synonyms:
CHEMBL574980 | N-(4-fluorophenyl)-1-methyl-6-(4-phenylpiperazin-1-yl)-1H-pyrazolo[3,4-d]pyrimidin-4-amine
Type:
Small organic molecule
Emp. Form.:
C22H22FN7
Mol. Mass.:
403.4554
SMILES:
Cn1ncc2c(Nc3ccc(F)cc3)nc(nc12)N1CCN(CC1)c1ccccc1
: