Target
Aromatase
Ligand
BDBM50240798
Substrate
Meas. Tech.
ChEMBL_587693 (CHEMBL1037707)
IC50
92±n/a nM
Citation
 Neves, MADinis, TCColombo, GSá e Melo, ML An efficient steroid pharmacophore-based strategy to identify new aromatase inhibitors. Eur J Med Chem 44:4121-7 (2009)  
Target
Name:
Aromatase
Synonyms:
ARO1 CP19A_HUMAN CYP19 CYPXIX Cytochrome P450 19A1 Cytochrome P450-C19 (CYP19) FL cytokine receptor precursor | P-450AROM
Type:
Enzyme
Mol. Mass.:
57888.92
Organism:
Homo sapiens (Human)
Description:
P11511
Residue:
503
  
Inhibitor
Name:
BDBM50240798
Synonyms:
(8R,9S,10R,13S,14S)-4-Hydroxy-10,13-dimethyl-1,6,7,8,9,10,11,12,13,14,15,16-dodecahydro-2H-cyclopenta[a]phenanthrene-3,17-dione CHEMBL132530 | FORMESTANE
Type:
Small organic molecule
Emp. Form.:
C19H26O3
Mol. Mass.:
302.4079
SMILES:
C[C@]12CC[C@H]3[C@@H](CCC4C(=O)C(=O)CC[C@]34C)[C@@H]1CCC2=O
: