Target
Prostate-specific antigen
Ligand
BDBM50298728
Substrate
Meas. Tech.
ChEMBL_588029 (CHEMBL1048364)
Ki
>50±n/a nM
Citation
 LeBeau, AMBanerjee, SRPomper, MGMease, RCDenmeade, SR Optimization of peptide-based inhibitors of prostate-specific antigen (PSA) as targeted imaging agents for prostate cancer. Bioorg Med Chem 17:4888-93 (2009)  
Target
Name:
Prostate-specific antigen
Synonyms:
APS KLK3 Kallikrein-3 PSA Prostate-specific antigen Seminin
Type:
PROTEIN
Mol. Mass.:
28747.53
Organism:
Homo sapiens (Human)
Description:
ChEMBL_959198
Residue:
261
  
Inhibitor
Name:
BDBM50298728
Synonyms:
CHEMBL583571 | benzyl(2S,5S,8S,11S,14S)-8-(4-aminobutyl)-14-formyl-1-hydroxy-5-(hydroxymethyl)-11-isopropyl-16-methyl-3,6,9,12-tetraoxo-4,7,10,13-tetraazaheptadecan-2-ylcarbamate
Type:
Small organic molecule
Emp. Form.:
C31H50N6O9
Mol. Mass.:
650.7635
SMILES:
CC(C)C[C@H](NC(=O)[C@@H](NC(=O)[C@H](CCCCN)NC(=O)[C@H](CO)NC(=O)[C@H](CO)NC(=O)OCc1ccccc1)C(C)C)C=O
: