Target
Dihydrofolate reductase
Ligand
BDBM50298799
Substrate
Meas. Tech.
ChEMBL_588095 (CHEMBL1044821)
IC50
55±n/a nM
Citation
 Paulsen, JLLiu, JBolstad, DBSmith, AEPriestley, NDWright, DLAnderson, AC In vitro biological activity and structural analysis of 2,4-diamino-5-(2'-arylpropargyl)pyrimidine inhibitors of Candida albicans. Bioorg Med Chem 17:4866-72 (2009)  
Target
Name:
Dihydrofolate reductase
Synonyms:
DFR1 Dihydrofolate Reductase (DHFR) | Tetrahydrofolate dehydrogenase
Type:
Enzyme
Mol. Mass.:
22141.77
Organism:
Candida albicans
Description:
C. albicans DHFR was expressed in E. coli BL21, and purified to homogeneity.
Residue:
192
  
Inhibitor
Name:
BDBM50298799
Synonyms:
(+/-)-5-(3-(5-methoxy-2',6'-dimethylbiphenyl-3-yl)prop-1-ynyl)-6-methylpyrimidine-2,4-diamine | CHEMBL572717
Type:
Small organic molecule
Emp. Form.:
C23H24N4O
Mol. Mass.:
372.4629
SMILES:
COc1cc(CC#Cc2c(C)nc(N)nc2N)cc(c1)-c1c(C)cccc1C
: