Target
Dihydrofolate reductase
Ligand
BDBM25818
Substrate
Meas. Tech.
ChEMBL_588096 (CHEMBL1044822)
IC50
1700±n/a nM
Citation
 Paulsen, JLLiu, JBolstad, DBSmith, AEPriestley, NDWright, DLAnderson, AC In vitro biological activity and structural analysis of 2,4-diamino-5-(2'-arylpropargyl)pyrimidine inhibitors of Candida albicans. Bioorg Med Chem 17:4866-72 (2009)  
Target
Name:
Dihydrofolate reductase
Synonyms:
DHFR Dihydrofolate reductase (DHFR) | Tetrahydrofolate dehydrogenase
Type:
Enzyme
Mol. Mass.:
21453.99
Organism:
Homo sapiens (Human)
Description:
Recombinant human DHFR.
Residue:
187
  
Inhibitor
Name:
BDBM25818
Synonyms:
5-[3-(3-methoxy-5-phenylphenyl)but-1-yn-1-yl]-6-methylpyrimidine-2,4-diamine propargyl-based inhibitor, 10a (+/-)
Type:
Small organic molecule
Emp. Form.:
C22H22N4O
Mol. Mass.:
358.4363
SMILES:
COc1cc(cc(c1)-c1ccccc1)C(C)C#Cc1c(C)nc(N)nc1N
: