Target
Matrix metalloproteinase-16
Ligand
BDBM50299055
Substrate
Meas. Tech.
ChEMBL_591606 (CHEMBL1042359)
IC50
730±n/a nM
Citation
 Nuti, EPanelli, LCasalini, FAvramova, SIOrlandini, ESantamaria, SNencetti, STuccinardi, TMartinelli, ACercignani, GD'Amelio, NMaiocchi, AUggeri, FRossello, A Design, synthesis, biological evaluation, and NMR studies of a new series of arylsulfones as selective and potent matrix metalloproteinase-12 inhibitors. J Med Chem 52:6347-61 (2009)  
Target
Name:
Matrix metalloproteinase-16
Synonyms:
C8orf57 MMP-X2 MMP16_HUMAN MT-MMP 3 MT3MMP Matrix metalloproteinase 16 Membrane-type matrix metalloproteinase 3 | Membrane-type-3 matrix metalloproteinase
Type:
PROTEIN
Mol. Mass.:
69536.76
Organism:
Homo sapiens (Human)
Description:
ChEMBL_799129
Residue:
607
  
Inhibitor
Name:
BDBM50299055
Synonyms:
CHEMBL573936 | [2-(4'-Methoxy-biphenyl-4-sulfonyl)phenyl]acetic Acid
Type:
Small organic molecule
Emp. Form.:
C21H18O5S
Mol. Mass.:
382.43
SMILES:
COc1ccc(cc1)-c1ccc(cc1)S(=O)(=O)c1ccccc1CC(O)=O
: