Target
Alpha-1A adrenergic receptor
Ligand
BDBM29568
Substrate
Meas. Tech.
ChEMBL_592535 (CHEMBL1046742)
IC50
0.254±n/a nM
Citation
 Biancalani, CGiovannoni, MPPieretti, SCesari, NGraziano, AVergelli, CCilibrizzi, ADi Gianuario, AColucci, MMangano, GGarrone, BPolenzani, LDal Piaz, V Further studies on arylpiperazinyl alkyl pyridazinones: discovery of an exceptionally potent, orally active, antinociceptive agent in thermally induced pain. J Med Chem 52:7397-409 (2009)  
Target
Name:
Alpha-1A adrenergic receptor
Synonyms:
ADA1A_RAT Adra1c Alpha-1A adrenoceptor Alpha-1C adrenergic receptor | adrenergic Alpha1A
Type:
Protein
Mol. Mass.:
51620.15
Organism:
Rattus norvegicus (Rat)
Description:
P43140
Residue:
466
  
Inhibitor
Name:
BDBM29568
Synonyms:
CHEMBL2 PRAZOSIN HYDROCHLORIDE [3H]-Minipress [3H]-Prazosin
Type:
radiolabeled ligand
Emp. Form.:
C19H21N5O4
Mol. Mass.:
383.4011
SMILES:
COc1cc2nc(nc(N)c2cc1OC)N1CCN(CC1)C(=O)c1ccco1
: