Target
Tyrosine-protein phosphatase non-receptor type 2
Ligand
BDBM50219573
Substrate
Meas. Tech.
ChEMBL_590754 (CHEMBL1050896)
Ki
36±n/a nM
Citation
 Vidovic, DSchürer, SC Knowledge-based characterization of similarity relationships in the human protein-tyrosine phosphatase family for rational inhibitor design. J Med Chem 52:6649-59 (2009)  
Target
Name:
Tyrosine-protein phosphatase non-receptor type 2
Synonyms:
PTN2_HUMAN PTPT T-cell protein-tyrosine phosphatase TCPTP Tyrosine-protein phosphatase non-receptor type 2 (TC-PTP)
Type:
Protein
Mol. Mass.:
48481.80
Organism:
Homo sapiens (Human)
Description:
P17706
Residue:
415
  
Inhibitor
Name:
BDBM50219573
Synonyms:
4-BROMO-3-(CARBOXYMETHOXY)-5-{3-[(3,3,5,5-TETRAMETHYLCYCLOHEXYL)AMINO]PHENYL}THIOPHENE-2-CARBOXYLIC ACID 4-bromo-3-carboxymethoxy-5-[3-(3,3,5,5-tetramethylcyclohexylamino)phenyl]thiophene-2-carboxylic acid | CHEMBL243942
Type:
Small organic molecule
Emp. Form.:
C23H28BrNO5S
Mol. Mass.:
510.441
SMILES:
CC1(C)CC(CC(C)(C)C1)Nc1cccc(c1)-c1sc(C(O)=O)c(OCC(O)=O)c1Br
: