Target
Receptor-type tyrosine-protein phosphatase alpha
Ligand
BDBM50299461
Substrate
Meas. Tech.
ChEMBL_590760 (CHEMBL1037598)
Ki
>500000±n/a nM
Citation
 Vidovic, DSchürer, SC Knowledge-based characterization of similarity relationships in the human protein-tyrosine phosphatase family for rational inhibitor design. J Med Chem 52:6649-59 (2009)  
Target
Name:
Receptor-type tyrosine-protein phosphatase alpha
Synonyms:
PTPA PTPRA_HUMAN Protein-tyrosine phosphatase alpha
Type:
Enzyme
Mol. Mass.:
90719.02
Organism:
Homo sapiens (Human)
Description:
P18433
Residue:
802
  
Inhibitor
Name:
BDBM50299461
Synonyms:
(S)-7-(1,1-Dioxo-1H-1lambda*6*-benzo[d]isothiazol-3-yloxymethyl)-2-(oxalyl-amino)-4,7-dihydro-5H-thieno[2,3-c]pyran-3-carboxylic acid CHEMBL577144
Type:
Small organic molecule
Emp. Form.:
C18H14N2O9S2
Mol. Mass.:
466.442
SMILES:
OC(=O)C(=O)Nc1sc2[C@H](COC3=NS(=O)(=O)c4ccccc34)OCCc2c1C(O)=O
: