Target
Neuromedin-K receptor
Ligand
BDBM50299470
Substrate
Meas. Tech.
ChEMBL_590802 (CHEMBL1037640)
Ki
8±n/a nM
Citation
 Malherbe, PKratzeisen, CMarcuz, AZenner, MTNettekoven, MHRatni, HWettstein, JGBissantz, C Identification of a critical residue in the transmembrane domain 2 of tachykinin neurokinin 3 receptor affecting the dissociation kinetics and antagonism mode of osanetant (SR 142801) and piperidine-based structures. J Med Chem 52:7103-12 (2009)  
Target
Name:
Neuromedin-K receptor
Synonyms:
NK3R_CAVPO Neurokinin NK3 TACR3
Type:
Enzyme Catalytic Domain
Mol. Mass.:
49456.44
Organism:
GUINEA PIG
Description:
Neurokinin NK3 TACR3 GUINEA PIG::P30098
Residue:
440
  
Inhibitor
Name:
BDBM50299470
Synonyms:
4-[4-(acetylmethyl-amino)-piperidin-1-yl]-N-(2-chloro-benzyl)-2-(3,4-dichlorophenyl)-2,N-dimethylbutyramide | CHEMBL567198
Type:
Small organic molecule
Emp. Form.:
C27H34Cl3N3O2
Mol. Mass.:
538.937
SMILES:
CN(Cc1ccccc1Cl)C(=O)C(C)(CCN1CCC(CC1)N(C)C(C)=O)c1ccc(Cl)c(Cl)c1
: