Target
17-beta-hydroxysteroid dehydrogenase type 2
Ligand
BDBM25864
Substrate
Meas. Tech.
ChEMBL_592405 (CHEMBL1036978)
IC50
4509±n/a nM
Citation
 Bey, EMarchais-Oberwinkler, SNegri, MKruchten, POster, AKlein, TSpadaro, AWerth, RFrotscher, MBirk, BHartmann, RW New insights into the SAR and binding modes of bis(hydroxyphenyl)thiophenes and -benzenes: influence of additional substituents on 17beta-hydroxysteroid dehydrogenase type 1 (17beta-HSD1) inhibitory activity and selectivity. J Med Chem 52:6724-43 (2009)  
Target
Name:
17-beta-hydroxysteroid dehydrogenase type 2
Synonyms:
17-beta-Hydroxysteroid Dehydrogenase 2 (17-beta-HSD2) 20-alpha-HSD EDH17B2 Estradiol 17-beta-dehydrogenase 2 (17beta-HSD2) Microsomal 17-beta-hydroxysteroid dehydrogenas Testosterone 17-beta-dehydrogenase
Type:
Oxidoreductase; single-pass type II membrane protein
Mol. Mass.:
42795.29
Organism:
Homo sapiens (Human)
Description:
Enzyme was partially purified from human placenta.
Residue:
387
  
Inhibitor
Name:
BDBM25864
Synonyms:
3-[4-(4-hydroxyphenyl)phenyl]phenol | hydroxyphenyl substituted benzene, 36
Type:
Small organic molecule
Emp. Form.:
C18H14O2
Mol. Mass.:
262.3026
SMILES:
Oc1ccc(cc1)-c1ccc(cc1)-c1cccc(O)c1
: