Target
Sodium-dependent serotonin transporter
Ligand
BDBM50299783
Substrate
Meas. Tech.
ChEMBL_589390 (CHEMBL1047385)
EC50
915±n/a nM
Citation
 Gray, DLXu, WCampbell, BMDounay, ABBarta, NBoroski, SDenny, LEvans, LStratman, NProbert, A Discovery and pharmacological characterization of aryl piperazine and piperidine ethers as dual acting norepinephrine reuptake inhibitors and 5-HT1A partial agonists. Bioorg Med Chem Lett 19:6604-7 (2009)  
Target
Name:
Sodium-dependent serotonin transporter
Synonyms:
5-HT Transporter 5HTT SC6A4_HUMAN SLC6A4 Serotonin transporter (5HTT) Sodium-dependent serotonin transporter (SERT) | Solute carrier family 6 member 4
Type:
Multi-pass membrane protein
Mol. Mass.:
70322.51
Organism:
Homo sapiens (Human)
Description:
P31645
Residue:
630
  
Inhibitor
Name:
BDBM50299783
Synonyms:
4-(2-fluoro-6-(3-fluorophenoxy)phenyl)piperidine | CHEMBL574004
Type:
Small organic molecule
Emp. Form.:
C17H17F2NO
Mol. Mass.:
289.3198
SMILES:
Fc1cccc(Oc2cccc(F)c2C2CCNCC2)c1
: