Target
Beta-1 adrenergic receptor
Ligand
BDBM50299891
Substrate
Meas. Tech.
ChEMBL_590084 (CHEMBL1044763)
EC50
3.7±n/a nM
Citation
 Hoenke, CBouyssou, TTautermann, CSRudolf, KSchnapp, AKonetzki, I Use of 5-hydroxy-4H-benzo[1,4]oxazin-3-ones as beta2-adrenoceptor agonists. Bioorg Med Chem Lett 19:6640-4 (2009)  
Target
Name:
Beta-1 adrenergic receptor
Synonyms:
ADRB1 ADRB1_HUMAN Beta-1 adrenoceptor | adrenergic Beta1
Type:
G Protein-Coupled Receptor (GPCR)
Mol. Mass.:
51338.40
Organism:
Homo sapiens (Human)
Description:
P08588
Residue:
477
  
Inhibitor
Name:
BDBM50299891
Synonyms:
5-hydroxy-8-(1-hydroxy-2-(2-methyl-1-(4-(trifluoromethyl)phenyl)propan-2-ylamino)ethyl)-2H-benzo[b][1,4]oxazin-3(4H)-one | CHEMBL584498
Type:
Small organic molecule
Emp. Form.:
C21H23F3N2O4
Mol. Mass.:
424.4135
SMILES:
CC(C)(Cc1ccc(cc1)C(F)(F)F)NCC(O)c1ccc(O)c2NC(=O)COc12
: