Target
Voltage-dependent L-type calcium channel subunit alpha-1D
Ligand
BDBM50299980
Substrate
Meas. Tech.
ChEMBL_593058 (CHEMBL1039574)
IC50
23400±n/a nM
Citation
 Blass, BEFensome, ATrybulski, EMagolda, RGardell, SJLiu, KSamuel, MFeingold, IHuselton, CJackson, CMDjandjighian, LHo, DHennan, JJanusz, JM Selective Kv1.5 blockers: development of (R)-1-(methylsulfonylamino)-3-[2-(4-methoxyphenyl)ethyl]-4-(4-methoxyphenyl)-2-imidazolidinone (KVI-020/WYE-160020) as a potential treatment for atrial arrhythmia. J Med Chem 52:6531-4 (2009)  
Target
Name:
Voltage-dependent L-type calcium channel subunit alpha-1D
Synonyms:
CAC1D_HUMAN CACN4 CACNL1A2 Calcium channel, L type, alpha-1 polypeptide, isoform 2 Voltage-gated L-type calcium channel Voltage-gated calcium channel | Voltage-gated calcium channel subunit alpha Cav1.3
Type:
PROTEIN
Mol. Mass.:
245144.84
Organism:
Homo sapiens (Human)
Description:
ChEMBL_1350501
Residue:
2161
  
Inhibitor
Name:
BDBM50299980
Synonyms:
(R)-1-(Methylsulfonylamino)-3-[2-(4-methoxyphenyl)ethyl]-4-(4-methoxy-phenyl)-2-imidazolidinone | CHEMBL569185
Type:
Small organic molecule
Emp. Form.:
C20H25N3O5S
Mol. Mass.:
419.495
SMILES:
COc1ccc(CCN2[C@@H](CN(NS(C)(=O)=O)C2=O)c2ccc(OC)cc2)cc1
: