Target
Poly [ADP-ribose] polymerase 1
Ligand
BDBM50300025
Substrate
Meas. Tech.
ChEMBL_593118 (CHEMBL1042276)
Ki
16±n/a nM
Citation
 Tong, YBouska, JJEllis, PAJohnson, EFLeverson, JLiu, XMarcotte, PAOlson, AMOsterling, DJPrzytulinska, MRodriguez, LEShi, YSoni, NStavropoulos, JThomas, SDonawho, CKFrost, DJLuo, YGiranda, VLPenning, TD Synthesis and evaluation of a new generation of orally efficacious benzimidazole-based poly(ADP-ribose) polymerase-1 (PARP-1) inhibitors as anticancer agents. J Med Chem 52:6803-13 (2009)  
Target
Name:
Poly [ADP-ribose] polymerase 1
Synonyms:
(ARTD1 or PARP1) 2.4.2.30 ADPRT ARTD1 Human diphtheria toxin-like ADP-ribosyltransferase (ARTD1 or PARP1) NT-PARP-1 PARP1 PPOL Poly [ADP-ribose] polymerase 1 (PARP) Poly [ADP-ribose] polymerase 1 (PARP1) Poly [ADP-ribose] polymerase 1, 28-kDa form Poly [ADP-ribose] polymerase 1, processed C-terminus Poly [ADP-ribose] polymerase-1 Poly(ADP-ribose) polymerase-1 (ARTD1/PARP1) Protein poly-ADP-ribosyltransferase PARP1 | Synonyms=ADPRT
Type:
Mol. Mass.:
113114.22
Organism:
Homo sapiens (Human)
Description:
P09874
Residue:
1014
  
Inhibitor
Name:
BDBM50300025
Synonyms:
2-(4-(5-Oxo-4,5-dihydro-1,2,4-oxadiazol-3-yl)phenyl)-1Hbenzo[d]imidazole-4-carboxamide | CHEMBL578559
Type:
Small organic molecule
Emp. Form.:
C16H11N5O3
Mol. Mass.:
321.2902
SMILES:
NC(=O)c1cccc2[nH]c(nc12)-c1ccc(cc1)-c1nc(=O)o[nH]1
: