Target
Vascular endothelial growth factor receptor 3
Ligand
BDBM50300026
Substrate
Meas. Tech.
ChEMBL_593149 (CHEMBL1044063)
IC50
2700±n/a nM
Citation
 Cha, MYLee, KOKim, JWLee, CGSong, JYKim, YHLee, GSPark, SBKim, MS Discovery of a novel Her-1/Her-2 dual tyrosine kinase inhibitor for the treatment of Her-1 selective inhibitor-resistant non-small cell lung cancer. J Med Chem 52:6880-8 (2009)  
Target
Name:
Vascular endothelial growth factor receptor 3
Synonyms:
FLT-4 Fms-like tyrosine kinase 4 VEGFR-3 VGFR3_HUMAN Vascular endothelial growth factor receptor 3 (VEGFR-3) | Vascular endothelial growth factor receptor 3 (VEGFR3)
Type:
Protein
Mol. Mass.:
152749.58
Organism:
Homo sapiens (Human)
Description:
P35916-2
Residue:
1363
  
Inhibitor
Name:
BDBM50300026
Synonyms:
(S)-1-Acryloyl-N-[4-(3-chloro-2-fluorophenylamino)-7-(2-methoxyethoxy)quinazolin-6-yl]pyrrolidine-2-carboxamide | CHEMBL571040
Type:
Small organic molecule
Emp. Form.:
C25H25ClFN5O4
Mol. Mass.:
513.949
SMILES:
COCCOc1cc2ncnc(Nc3cccc(Cl)c3F)c2cc1NC(=O)[C@@H]1CCCN1C(=O)C=C
: