Target
Serine/threonine-protein kinase mTOR
Ligand
BDBM50300075
Substrate
Meas. Tech.
ChEMBL_593489 (CHEMBL1047613)
IC50
0.20±n/a nM
Citation
 Zask, AKaplan, JVerheijen, JCRichard, DJCurran, KBrooijmans, NBennett, EMToral-Barza, LHollander, IAyral-Kaloustian, SYu, K Morpholine derivatives greatly enhance the selectivity of mammalian target of rapamycin (mTOR) inhibitors. J Med Chem 52:7942-5 (2009)  
Target
Name:
Serine/threonine-protein kinase mTOR
Synonyms:
FK506-binding protein 12-rapamycin complex-associated protein 1 FRAP FRAP1 MTOR Mammalian Target of Rapamycin (mTOR) RAFT1 Rapamycin and FKBP12 target 1 Serine/threonine-protein kinase (mTOR) | mTORC2
Type:
Rapamycin target protein
Mol. Mass.:
288917.12
Organism:
Homo sapiens (Human)
Description:
P42345
Residue:
2549
  
Inhibitor
Name:
BDBM50300075
Synonyms:
1-(4-(4-(3-oxa-8-azabicyclo[3.2.1]octan-8-yl)-1-(2,2,2-trifluoroethyl)-1H-pyrazolo[3,4-d]pyrimidin-6-yl)phenyl)-3-(pyridin-3-yl)urea | CHEMBL567172
Type:
Small organic molecule
Emp. Form.:
C25H23F3N8O2
Mol. Mass.:
524.4977
SMILES:
FC(F)(F)Cn1ncc2c(nc(nc12)-c1ccc(NC(=O)Nc2cccnc2)cc1)N1C2CCC1COC2
: