Target
High affinity cGMP-specific 3',5'-cyclic phosphodiesterase 9A
Ligand
BDBM50300104
Substrate
Meas. Tech.
ChEMBL_593497 (CHEMBL1047621)
IC50
200±n/a nM
Citation
 Verhoest, PRProulx-Lafrance, CCorman, MChenard, LHelal, CJHou, XKleiman, RLiu, SMarr, EMenniti, FSSchmidt, CJVanase-Frawley, MSchmidt, AWWilliams, RDNelson, FRFonseca, KRLiras, S Identification of a brain penetrant PDE9A inhibitor utilizing prospective design and chemical enablement as a rapid lead optimization strategy. J Med Chem 52:7946-9 (2009)  
Target
Name:
High affinity cGMP-specific 3',5'-cyclic phosphodiesterase 9A
Synonyms:
3',5'-cyclic phosphodiesterase PDE9A_HUMAN Phosphodiesterase 9A (PDE9) | Phosphodiesterase 9A (PDE9A)
Type:
Protein
Mol. Mass.:
68488.40
Organism:
Homo sapiens (Human)
Description:
O76083
Residue:
593
  
Inhibitor
Name:
BDBM50300104
Synonyms:
CHEMBL582856 | trans-1-cyclopentyl-6-(4-methyl-1-(pyridin-2-ylmethyl)pyrrolidin-3-yl)-1H-pyrazolo[3,4-d]pyrimidin-4(5H)-one
Type:
Small organic molecule
Emp. Form.:
C21H26N6O
Mol. Mass.:
378.4707
SMILES:
C[C@@H]1CN(Cc2ccccn2)C[C@H]1c1nc2n(ncc2c(=O)[nH]1)C1CCCC1
: