Target
E3 ubiquitin-protein ligase Mdm2
Ligand
BDBM31202
Substrate
Meas. Tech.
ChEMBL_593610 (CHEMBL1039715)
IC50
28.3±n/a nM
Citation
 Yu, SQin, DShangary, SChen, JWang, GDing, KMcEachern, DQiu, SNikolovska-Coleska, ZMiller, RKang, SYang, DWang, S Potent and orally active small-molecule inhibitors of the MDM2-p53 interaction. J Med Chem 52:7970-3 (2009)  
Target
Name:
E3 ubiquitin-protein ligase Mdm2
Synonyms:
Double minute 2 protein E3 ubiquitin-protein ligase Mdm2 (p53-binding protein Mdm2) Human Double Minute 2 (HDM2) MDM2-MDMX p53-Binding Protein MDM2 | p53-binding protein
Type:
Oncoprotein
Mol. Mass.:
55196.54
Organism:
Homo sapiens (Human)
Description:
Q00987
Residue:
491
  
Inhibitor
Name:
BDBM31202
Synonyms:
JMC493432 Compound 8 | MI-63
Type:
Small organic molecule
Emp. Form.:
C29H35Cl2FN4O3
Mol. Mass.:
577.518
SMILES:
CC(C)(C)C[C@H]1N[C@H]([C@H](c2cccc(Cl)c2F)[C@@]11C(=O)Nc2cc(Cl)ccc12)C(=O)NCCN1CCOCC1
: