Target
Corticotropin-releasing factor receptor 1
Ligand
BDBM50300140
Substrate
Meas. Tech.
ChEMBL_593894 (CHEMBL1037787)
IC50
1.7±n/a nM
Citation
 Hartz, RAAhuja, VTZhuo, XMattson, RJDenhart, DJDeskus, JAVrudhula, VMPan, SDitta, JLShu, YZGrace, JELentz, KALelas, SLi, YWMolski, TFKrishnananthan, SWong, HQian-Cutrone, JSchartman, RDenton, RLodge, NJZaczek, RMacor, JEBronson, JJ A strategy to minimize reactive metabolite formation: discovery of (S)-4-(1-cyclopropyl-2-methoxyethyl)-6-[6-(difluoromethoxy)-2,5-dimethylpyridin-3-ylamino]-5-oxo-4,5-dihydropyrazine-2-carbonitrile as a potent, orally bioavailable corticotropin-releasing factor-1 receptor antagonist. J Med Chem 52:7653-68 (2009)  
Target
Name:
Corticotropin-releasing factor receptor 1
Synonyms:
CRF-R CRFR1_RAT Corticotropin releasing factor receptor Corticotropin-releasing Factor Receptor 1 Crhr | Crhr1
Type:
G Protein-Coupled Receptor (GPCR)
Mol. Mass.:
47870.75
Organism:
Rattus norvegicus (rat)
Description:
Receptor binding assays were performed using rat cortex homogenate.
Residue:
415
  
Inhibitor
Name:
BDBM50300140
Synonyms:
(R)-4-(1-Cyclopropylpropyl)-6-(6-methoxy-2,5-dimethylpyridin-3-ylamino)-5-oxo-4,5-dihydropyrazine-2-carbonitrile | CHEMBL573976
Type:
Small organic molecule
Emp. Form.:
C19H23N5O2
Mol. Mass.:
353.4182
SMILES:
CC[C@H](C1CC1)n1cc(nc(Nc2cc(C)c(OC)nc2C)c1=O)C#N
: