Target
5-hydroxytryptamine receptor 2C
Ligand
BDBM50300160
Substrate
Meas. Tech.
ChEMBL_594167 (CHEMBL1039597)
Ki
50.4±n/a nM
Citation
 Frecentese, FFiorino, FPerissutti, ESeverino, BMagli, EEsposito, ADe Angelis, FMassarelli, PNencini, CViti, BSantagada, VCaliendo, G Efficient microwave combinatorial synthesis of novel indolic arylpiperazine derivatives as serotoninergic ligands. Eur J Med Chem 45:752-9 (2010)  
Target
Name:
5-hydroxytryptamine receptor 2C
Synonyms:
5-HT2C 5-hydroxytryptamine receptor 2C (5HT2c) 5ht1c Htr2c Serotonin receptor 2a and 2c (5HT2A and 5HT2C)
Type:
Enzyme
Mol. Mass.:
51935.10
Organism:
Rattus norvegicus (Rat)
Description:
P08909
Residue:
460
  
Inhibitor
Name:
BDBM50300160
Synonyms:
CHEMBL565707 | Ethyl 5-(3-(4-(4-methoxyphenyl)piperazin-1-yl)propoxy)-1H-indole-2-carboxylate
Type:
Small organic molecule
Emp. Form.:
C25H31N3O4
Mol. Mass.:
437.5313
SMILES:
CCOC(=O)c1cc2cc(OCCCN3CCN(CC3)c3ccc(OC)cc3)ccc2[nH]1
: