Target
Beta-secretase 1
Ligand
BDBM50300187
Substrate
Meas. Tech.
ChEMBL_594469 (CHEMBL1041518)
IC50
0.320000±n/a nM
Citation
 Meredith, JABjörklund, CAdolfsson, HJansson, KHallberg, ARosenquist, ASamuelsson, B P2'-truncated BACE-1 inhibitors with a novel hydroxethylene-like core. Eur J Med Chem 45:542-54 (2010)  
Target
Name:
Beta-secretase 1
Synonyms:
ASP2 Aspartyl protease 2 BACE1 Beta-secretase (BACE) Beta-secretase 1 (BACE 1) Beta-secretase 1 (BACE1) Beta-site amyloid precursor protein cleaving enzyme 1 Memapsin-2 beta-Secretase (BACE-1) | beta-Secretase (BACE1)
Type:
Protein
Mol. Mass.:
55755.10
Organism:
Homo sapiens (Human)
Description:
P56817
Residue:
501
  
Inhibitor
Name:
BDBM50300187
Synonyms:
CHEMBL573106 N1-((2S,3S,5R)-6-((S)-1-(benzylamino)-3-methyl-1-oxobutan-2-ylamino)-1-(3,5-difluorophenoxy)-3-hydroxy-5-methoxy-6-oxohexan-2-yl)-5-(N-methylmethylsulfonamido)-N3-((R)-1-phenylethyl)isophthalamide
Type:
Small organic molecule
Emp. Form.:
C43H51F2N5O9S
Mol. Mass.:
851.955
SMILES:
CO[C@H](C[C@H](O)[C@H](COc1cc(F)cc(F)c1)NC(=O)c1cc(cc(c1)C(=O)N[C@H](C)c1ccccc1)N(C)S(C)(=O)=O)C(=O)N[C@@H](C(C)C)C(=O)NCc1ccccc1
: