Target
Ectonucleotide pyrophosphatase/phosphodiesterase family member 2
Ligand
BDBM50300208
Substrate
Meas. Tech.
ChEMBL_592909 (CHEMBL1048412)
Ki
13200±n/a nM
Citation
 Hoeglund, ABBostic, HEHoward, ALWanjala, IWBest, MDBaker, DLParrill, AL Optimization of a pipemidic acid autotaxin inhibitor. J Med Chem 53:1056-66 (2010)  
Target
Name:
Ectonucleotide pyrophosphatase/phosphodiesterase family member 2
Synonyms:
ATX Autotaxin (ATX) ENPP2 Ectonucleotide Pyrophosphatase/Phosphodiesterase 2 (ENPP2) Extracellular lysophospholipase D PDNP2
Type:
Enzyme
Mol. Mass.:
99007.13
Organism:
Homo sapiens (Human)
Description:
Q13822
Residue:
863
  
Inhibitor
Name:
BDBM50300208
Synonyms:
2-(4-{[(4-Trifluoromethylphenyl)amino]carbonothioyl}-1-piperazinyl)-8-ethyl-5-oxo-5,8-dihydropyrido[2,3-d]pyrimidine-6-carboxylic Acid | CHEMBL570823
Type:
Small organic molecule
Emp. Form.:
C22H21F3N6O3S
Mol. Mass.:
506.501
SMILES:
CCn1cc(C(O)=O)c(=O)c2cnc(nc12)N1CCN(CC1)C(=S)Nc1ccc(cc1)C(F)(F)F
: