Target
Ras-related C3 botulinum toxin substrate 1
Ligand
BDBM50300550
Substrate
Meas. Tech.
ChEMBL_588743 (CHEMBL1053690)
IC50
104000±n/a nM
Citation
 Beausoleil, EChauvignac, CTaverne, TLacombe, SPognante, LLeblond, BPallares, DOliveira, CDBachelot, FCarton, RPeillon, HCoutadeur, SPicard, VLambeng, NDésiré, LSchweighoffer, F Structure-activity relationship of isoform selective inhibitors of Rac1/1b GTPase nucleotide binding. Bioorg Med Chem Lett 19:5594-8 (2009)  
Target
Name:
Ras-related C3 botulinum toxin substrate 1
Synonyms:
RAC1 Ras-related C3 botulinum toxin substrate 1 TC25
Type:
PROTEIN
Mol. Mass.:
21455.91
Organism:
Homo sapiens (Human)
Description:
ChEMBL_1337921
Residue:
192
  
Inhibitor
Name:
BDBM50300550
Synonyms:
3-(3,4-Dihydroxy-phenyl)-6,7-dimethoxy-1-methyl-isoquinolinium chloride | CHEMBL574677
Type:
Small organic molecule
Emp. Form.:
C18H17NO4
Mol. Mass.:
311.3319
SMILES:
COc1cc2cc(nc(C)c2cc1OC)-c1ccc(O)c(O)c1
: