Target
Oxysterols receptor LXR-beta
Ligand
BDBM50300578
Substrate
Meas. Tech.
ChEMBL_588778 (CHEMBL1054464)
EC50
145±n/a nM
Citation
 Marino, JPKallander, LSMa, COh, HJLee, DGaitanopoulos, DEKrawiec, JAParks, DJWebb, CLZiegler, KJaye, MThompson, SK The discovery of tertiary-amine LXR agonists with potent cholesterol efflux activity in macrophages. Bioorg Med Chem Lett 19:5617-21 (2009)  
Target
Name:
Oxysterols receptor LXR-beta
Synonyms:
LXRB Liver X, LXR beta NR1H2 Nuclear receptor NER Ubiquitously-expressed nuclear receptor
Type:
Enzyme Catalytic Domain
Mol. Mass.:
50978.79
Organism:
Homo sapiens (Human)
Description:
P55055
Residue:
460
  
Inhibitor
Name:
BDBM50300578
Synonyms:
(S)-2-(3-(4-((2-chloro-3-(trifluoromethyl)benzyl)(2,2-diphenylethyl)amino)butan-2-yloxy)phenyl)acetic acid | CHEMBL573591
Type:
Small organic molecule
Emp. Form.:
C34H33ClF3NO3
Mol. Mass.:
596.079
SMILES:
C[C@@H](CCN(CC(c1ccccc1)c1ccccc1)Cc1cccc(c1Cl)C(F)(F)F)Oc1cccc(CC(O)=O)c1
: