Target
Thioredoxin reductase 1, cytoplasmic
Ligand
BDBM50300753
Substrate
Meas. Tech.
ChEMBL_589950 (CHEMBL1050858)
IC50
150000±n/a nM
Citation
 Rai, GSayed, AALea, WALuecke, HFChakrapani, HPrast-Nielsen, SJadhav, ALeister, WShen, MInglese, JAustin, CPKeefer, LArnér, ESSimeonov, AMaloney, DJWilliams, DLThomas, CJ Structure mechanism insights and the role of nitric oxide donation guide the development of oxadiazole-2-oxides as therapeutic agents against schistosomiasis. J Med Chem 52:6474-83 (2009)  
Target
Name:
Thioredoxin reductase 1, cytoplasmic
Synonyms:
NADPH-dependent thioredoxin reductase TRXR1_RAT Trxr1 | Txnrd1
Type:
PROTEIN
Mol. Mass.:
54519.34
Organism:
Rattus norvegicus
Description:
ChEMBL_589950
Residue:
498
  
Inhibitor
Name:
BDBM50300753
Synonyms:
3-cyano-4-(3-nitrophenyl)-1,2,5-oxadiazole 2-oxide | CHEMBL570346
Type:
Small organic molecule
Emp. Form.:
C9H4N4O4
Mol. Mass.:
232.1525
SMILES:
[O-][N+](=O)c1cccc(c1)-c1no[n+]([O-])c1C#N
: