Target
Thioredoxin glutathione reductase
Ligand
BDBM50300748
Substrate
Meas. Tech.
ChEMBL_589927 (CHEMBL1048278)
IC50
3500±n/a nM
Citation
 Rai, GSayed, AALea, WALuecke, HFChakrapani, HPrast-Nielsen, SJadhav, ALeister, WShen, MInglese, JAustin, CPKeefer, LArnér, ESSimeonov, AMaloney, DJWilliams, DLThomas, CJ Structure mechanism insights and the role of nitric oxide donation guide the development of oxadiazole-2-oxides as therapeutic agents against schistosomiasis. J Med Chem 52:6474-83 (2009)  
Target
Name:
Thioredoxin glutathione reductase
Synonyms:
Type:
PROTEIN
Mol. Mass.:
64881.48
Organism:
Schistosoma mansoni
Description:
ChEMBL_1455608
Residue:
597
  
Inhibitor
Name:
BDBM50300748
Synonyms:
4-(4-bromophenyl)-3-cyano-1,2,5-oxadiazole 2-oxide | CHEMBL585368
Type:
Small organic molecule
Emp. Form.:
C9H4BrN3O2
Mol. Mass.:
266.051
SMILES:
[O-][n+]1onc(c1C#N)-c1ccc(Br)cc1
: