Target
Mitogen-activated protein kinase 14
Ligand
BDBM50300893
Substrate
Meas. Tech.
ChEMBL_599883 (CHEMBL1045448)
IC50
41±n/a nM
Citation
 Peifer, CAbadleh, MBischof, JHauser, DSchattel, VHirner, HKnippschild, ULaufer, S 3,4-Diaryl-isoxazoles and -imidazoles as potent dual inhibitors of p38alpha mitogen activated protein kinase and casein kinase 1delta. J Med Chem 52:7618-30 (2009)  
Target
Name:
Mitogen-activated protein kinase 14
Synonyms:
CSAID-binding protein CSBP1 CSPB1 MAP kinase 14 MAP kinase p38 alpha MAPK14 MK14_HUMAN Mitogen-activated protein kinase p38 alpha Stress-activated protein kinase 2a | p38 MAP kinase alpha/beta
Type:
Serine/threonine-protein kinase
Mol. Mass.:
41286.76
Organism:
Homo sapiens (Human)
Description:
Q16539
Residue:
360
  
Inhibitor
Name:
BDBM50300893
Synonyms:
(E)-3-(2,4-Dimethoxy-phenyl)-N-(4-[5-(4-fluoro-phenyl)-2-methanesulfinyl-3H-imidazol-4-yl]-pyridin-2-yl)-acrylamide | CHEMBL572006
Type:
Small organic molecule
Emp. Form.:
C26H23FN4O4S
Mol. Mass.:
506.549
SMILES:
COc1ccc(C=CC(=O)Nc2cc(ccn2)-c2nc([nH]c2-c2ccc(F)cc2)S(C)=O)c(OC)c1
: