Target
cGMP-inhibited 3',5'-cyclic phosphodiesterase 3A
Ligand
BDBM15296
Substrate
Meas. Tech.
ChEMBL_600852 (CHEMBL1042810)
IC50
11400±n/a nM
Citation
 Abadi, AHIbrahim, TMAbouzid, KMLehmann, JTinsley, HNGary, BDPiazza, GA Design, synthesis and biological evaluation of novel pyridine derivatives as anticancer agents and phosphodiesterase 3 inhibitors. Bioorg Med Chem 17:5974-82 (2009)  
Target
Name:
cGMP-inhibited 3',5'-cyclic phosphodiesterase 3A
Synonyms:
3',5'-cyclic phosphodiesterase Cyclic GMP-inhibited phosphodiesterase A PDE3A_HUMAN Phosphodiesterase 3 (PDE3) Phosphodiesterase 3A Phosphodiesterase 3A (PDE3A1) cGMP-inhibited 3',5'-cyclic phosphodiesterase A | cGMP-inhibited 3,5-cyclic phosphodiesterase A
Type:
Enzyme
Mol. Mass.:
124966.46
Organism:
Homo sapiens (Human)
Description:
Q14432
Residue:
1141
  
Inhibitor
Name:
BDBM15296
Synonyms:
6-methyl-2-oxo-5-(pyridin-4-yl)-1,2-dihydropyridine-3-carbonitrile CHEMBL189 Primacor US9249139, Milrinone
Type:
Small organic molecule
Emp. Form.:
C12H9N3O
Mol. Mass.:
211.2194
SMILES:
Cc1[nH]c(=O)c(cc1-c1ccncc1)C#N
: