Target
C-X-C chemokine receptor type 3
Ligand
BDBM50300914
Substrate
Meas. Tech.
ChEMBL_600879 (CHEMBL1042837)
IC50
100±n/a nM
Citation
 Du, XGustin, DJChen, XDuquette, JMcGee, LRWang, ZEbsworth, KHenne, KLemon, BMa, JMiao, SSabalan, ESullivan, TJTonn, GCollins, TLMedina, JC Imidazo-pyrazine derivatives as potent CXCR3 antagonists. Bioorg Med Chem Lett 19:5200-4 (2009)  
Target
Name:
C-X-C chemokine receptor type 3
Synonyms:
AAO92295.1 C-X-C chemokine receptor type 3 (CXCR3) CXCR3 CXCR3_HUMAN chemokine (C-X-C motif) receptor 3
Type:
Enzyme Catalytic Domain
Mol. Mass.:
40665.65
Organism:
Homo sapiens (Human)
Description:
Residue:
368
  
Inhibitor
Name:
BDBM50300914
Synonyms:
(R)-N-(1-(3-(4-cyanophenyl)-7-methylimidazo[1,2-a]pyrimidin-2-yl)ethyl)-N-(2-(ethylsulfonyl)ethyl)-2-(4-fluoro-3-(trifluoromethyl)phenyl)acetamide | CHEMBL577108
Type:
Small organic molecule
Emp. Form.:
C29H27F4N5O3S
Mol. Mass.:
601.615
SMILES:
CCS(=O)(=O)CCN([C@H](C)c1nc2nc(C)ccn2c1-c1ccc(cc1)C#N)C(=O)Cc1ccc(F)c(c1)C(F)(F)F
: