Target
C-X-C chemokine receptor type 3
Ligand
BDBM50300902
Substrate
Meas. Tech.
ChEMBL_600877 (CHEMBL1042835)
IC50
1.1±n/a nM
Citation
 Du, XGustin, DJChen, XDuquette, JMcGee, LRWang, ZEbsworth, KHenne, KLemon, BMa, JMiao, SSabalan, ESullivan, TJTonn, GCollins, TLMedina, JC Imidazo-pyrazine derivatives as potent CXCR3 antagonists. Bioorg Med Chem Lett 19:5200-4 (2009)  
Target
Name:
C-X-C chemokine receptor type 3
Synonyms:
AAO92295.1 C-X-C chemokine receptor type 3 (CXCR3) CXCR3 CXCR3_HUMAN chemokine (C-X-C motif) receptor 3
Type:
Enzyme Catalytic Domain
Mol. Mass.:
40665.65
Organism:
Homo sapiens (Human)
Description:
Residue:
368
  
Inhibitor
Name:
BDBM50300902
Synonyms:
(R)-N-(1-(3-(4-cyanophenyl)-8-ethylimidazo[1,2-a]pyrazin-2-yl)ethyl)-N-(2-(ethylsulfonyl)ethyl)-2-(3-fluoro-4-(trifluoromethyl)phenyl)acetamide | CHEMBL578189
Type:
Small organic molecule
Emp. Form.:
C30H29F4N5O3S
Mol. Mass.:
615.642
SMILES:
CCc1nccn2c(c(nc12)[C@@H](C)N(CCS(=O)(=O)CC)C(=O)Cc1ccc(c(F)c1)C(F)(F)F)-c1ccc(cc1)C#N
: