Target
C-X-C chemokine receptor type 3
Ligand
BDBM50300900
Substrate
Meas. Tech.
ChEMBL_600878 (CHEMBL1042836)
IC50
17±n/a nM
Citation
 Du, XGustin, DJChen, XDuquette, JMcGee, LRWang, ZEbsworth, KHenne, KLemon, BMa, JMiao, SSabalan, ESullivan, TJTonn, GCollins, TLMedina, JC Imidazo-pyrazine derivatives as potent CXCR3 antagonists. Bioorg Med Chem Lett 19:5200-4 (2009)  
Target
Name:
C-X-C chemokine receptor type 3
Synonyms:
AAO92295.1 C-X-C chemokine receptor type 3 (CXCR3) CXCR3 CXCR3_HUMAN chemokine (C-X-C motif) receptor 3
Type:
Enzyme Catalytic Domain
Mol. Mass.:
40665.65
Organism:
Homo sapiens (Human)
Description:
Residue:
368
  
Inhibitor
Name:
BDBM50300900
Synonyms:
(R)-N-(1-(3-(4-cyanophenyl)-8-methoxyimidazo[1,2-a]pyrazin-2-yl)ethyl)-N-(2-(ethylsulfonyl)ethyl)-2-(3-fluoro-4-(trifluoromethyl)phenyl)acetamide | CHEMBL578187
Type:
Small organic molecule
Emp. Form.:
C29H27F4N5O4S
Mol. Mass.:
617.614
SMILES:
CCS(=O)(=O)CCN([C@H](C)c1nc2c(OC)nccn2c1-c1ccc(cc1)C#N)C(=O)Cc1ccc(c(F)c1)C(F)(F)F
: